Target
Orexin/Hypocretin receptor type 1
Ligand
BDBM175201
Substrate
Meas. Tech.
Radioligand Binding Assay
Ki
97±n/a nM
Citation
 Dvorak, CAShireman, BT Substituted piperidine compounds and their use as orexin receptor modulators US Patent  US9115117 Publication Date 8/25/2015 
Target
Name:
Orexin/Hypocretin receptor type 1
Synonyms:
HCRTR1 OX1R_HUMAN Orexin receptor type 1 (OR 1) Orexin receptor type 1 (OX1) Orexin receptor type 1 (OxR1) | Ox1r
Type:
Protein
Mol. Mass.:
47554.50
Organism:
Homo sapiens (Human)
Description:
O43613
Residue:
425
  
Inhibitor
Name:
BDBM175201
Synonyms:
US9115117, 103 | US9611251, 103
Type:
Small organic molecule
Emp. Form.:
C20H19F3N6O2
Mol. Mass.:
432.3991
SMILES:
C[C@H]1[C@@H](CCCN1C(=O)c1ccccc1-n1nccn1)Oc1ncc(cn1)C(F)(F)F
: