Target
Histamine H1 receptor
Ligand
BDBM179867
Substrate
Meas. Tech.
Radioligand Binding Assay
Ki
8.4±n/a nM
Citation
 De Colle, CPasricha, P Methods for treating GI tract disorders US Patent  US9132134 Publication Date 9/15/2015 
Target
Name:
Histamine H1 receptor
Synonyms:
H1R HISTAMINE H1 HRH1_HUMAN
Type:
G Protein-Coupled Receptor (GPCR)
Mol. Mass.:
55808.72
Organism:
Homo sapiens (Human)
Description:
Cell pellets from SK-N-MC cells transfected with human H1 receptor were used in binding assay.
Residue:
487
  
Inhibitor
Name:
BDBM179867
Synonyms:
US11147820, Compound Metopimazine | US9132134, Metopimazine (NG101)
Type:
Small organic molecule
Emp. Form.:
C22H27N3O3S2
Mol. Mass.:
445.598
SMILES:
CS(=O)(=O)c1ccc2Sc3ccccc3N(CCCN3CCC(CC3)C(O)=N)c2c1
: