Target
Methionine aminopeptidase 2
Ligand
BDBM148430
Substrate
Meas. Tech.
Biological Enzymatic Assay
pH
7.4±n/a
IC50
275±n/a nM
Comments
extracted
Citation
 Vath, JEZahler, R Fumagillol heterocyclic compounds and methods of making and using same US Patent  US9682965 Publication Date 6/20/2017 
Target
Name:
Methionine aminopeptidase 2
Synonyms:
Initiation factor 2-associated 67 kDa glycoprotein MAP2_HUMAN MNPEP Methionine aminopeptidase 2 (MetAP2) P67EIF2 p67
Type:
Enzyme
Mol. Mass.:
52884.45
Organism:
Homo sapiens (Human)
Description:
P50579
Residue:
478
  
Inhibitor
Name:
BDBM148430
Synonyms:
US9682965, Compound A
Type:
Small organic molecule
Emp. Form.:
C29H41NO6
Mol. Mass.:
499.6389
SMILES:
[#6]-[#8]-[#6@@H]-1-[#6@@H](-[#6]-[#6][C@]2([#6]-[#8]2)[#6@H]-1[C@@]1([#6])[#8]-[#6@@H]1-[#6]\[#6]=[#6](\[#6])-[#6])-[#8]-[#6](=O)\[#6]=[#6]\c1ccc(-[#8]-[#6]-[#6]-[#7](-[#6])-[#6])cc1
: