Target
Cytochrome P450 3A4
Ligand
BDBM181115
Substrate
Meas. Tech.
IC50
3000±n/a nM
Citation
 Bareja, SPJones, SDOblong, JEMills, KJBierman, JC Cosmetic compositions containing substituted azole and methods for improving the appearance of aging skin US Patent  US9138393 Publication Date 9/22/2015 
Target
Name:
Cytochrome P450 3A4
Synonyms:
Albendazole monooxygenase CP3A4_HUMAN CYP3A4 CYPIIIA4 Cytochrome P450 3A4 (CYP3A4) Nifedipine oxidase Taurochenodeoxycholate 6-alpha-hydroxylase
Type:
Enzyme
Mol. Mass.:
57349.57
Organism:
Homo sapiens (Human)
Description:
Residue:
503
  
Inhibitor
Name:
BDBM181115
Synonyms:
Butacide Butoxide, Piperonyl Rid Mousse US9144538, Piperonyl butoxide | pyrethrins
Type:
Small organic molecule
Emp. Form.:
C19H30O5
Mol. Mass.:
338.4385
SMILES:
CCCCOCCOCCOCc1cc2OCOc2cc1CCC
: