Target
Cytochrome P450 3A4
Ligand
BDBM82053
Substrate
Meas. Tech.
IC50
>10000±n/a nM
Citation
 Bareja, SPJones, SDOblong, JEMills, KJBierman, JC Cosmetic compositions containing substituted azole and methods for improving the appearance of aging skin US Patent  US9138393 Publication Date 9/22/2015 
Target
Name:
Cytochrome P450 3A4
Synonyms:
Albendazole monooxygenase CP3A4_HUMAN CYP3A4 CYPIIIA4 Cytochrome P450 3A4 (CYP3A4) Nifedipine oxidase Taurochenodeoxycholate 6-alpha-hydroxylase
Type:
Enzyme
Mol. Mass.:
57349.57
Organism:
Homo sapiens (Human)
Description:
Residue:
503
  
Inhibitor
Name:
BDBM82053
Synonyms:
8-(2-Furyl)theophylline US9144538, Theophylline
Type:
Emp. Form.:
C7H8N4O2
Mol. Mass.:
180.164
SMILES:
Cn1c2[nH]cnc2c(=O)n(C)c1=O
: