Target
Histamine H4 receptor
Ligand
BDBM94597
Substrate
Meas. Tech.
Histamine H-4 Receptor Binding Assay
IC50
21000±n/a nM
Citation
 Aberg, AKCiofalo, VB Methods of treatment of histamine H-4 receptor-related pruritus US Patent  US9138431 Publication Date 9/22/2015 
Target
Name:
Histamine H4 receptor
Synonyms:
AXOR35 GPCR105 HH4R HRH4 Histamine H4 receptor Histamine receptor (H3 and H4) SP9144
Type:
G Protein-Coupled Receptor (GPCR)
Mol. Mass.:
44517.02
Organism:
Homo sapiens (Human)
Description:
Binding assays were using CHO cells stably expressing hH4R receptors.
Residue:
390
  
Inhibitor
Name:
BDBM94597
Synonyms:
(Z)-2-butenedioate;10-(1-methyl-4-piperidinylidene)-5H-benzo[1,2]cyclohepta[3,4-b]thiophen-4-one 10-(1-methyl-4-piperidylidene)-5H-benzo[1,2]cyclohepta[3,4-b]thiophen-4-one;maleate Ketotifen fumarate SMR001307257 US9333199, KETOTIFEN cid_5282408
Type:
Small organic molecule
Emp. Form.:
C19H19NOS
Mol. Mass.:
309.425
SMILES:
[#6]-[#7]-1-[#6]-[#6]\[#6](-[#6]-[#6]-1)=[#6]-1/c2ccsc2-[#6](=O)-[#6]-c2ccccc-12
: