Target
Cytochrome P450 3A4
Ligand
BDBM50003659
Substrate
Meas. Tech.
In vitro CYP3A4 Inhibition Assay
IC50
>10000±n/a nM
Citation
 Bareja, SPJones, SDOblong, JEMills, KJBierman, JC Cosmetic compositions containing substituted azole and methods for alleviating the signs of photoaged skin US Patent  US9144538 Publication Date 9/29/2015 
Target
Name:
Cytochrome P450 3A4
Synonyms:
Albendazole monooxygenase CP3A4_HUMAN CYP3A4 CYPIIIA4 Cytochrome P450 3A4 (CYP3A4) Nifedipine oxidase Taurochenodeoxycholate 6-alpha-hydroxylase
Type:
Enzyme
Mol. Mass.:
57349.57
Organism:
Homo sapiens (Human)
Description:
Residue:
503
  
Inhibitor
Name:
BDBM50003659
Synonyms:
5H-dibenzo[b,f]azepine-5-carboxamide CARBATROL DIBENZO[B,F]AZEPINE-5-CARBOXYLIC ACID AMIDE(CARBAMAZEPINE) EQUETRO TEGRETOL TERIL US9144538, Carbamazepine
Type:
Small organic molecule
Emp. Form.:
C15H12N2O
Mol. Mass.:
236.2686
SMILES:
NC(=O)N1c2ccccc2C=Cc2ccccc12
: