Target
Sphingosine 1-phosphate receptor 1
Ligand
BDBM183683
Substrate
Meas. Tech.
35S-GTPgammaS Binding
pH
7.4±n/a
Temperature
303.15±n/a K
EC50
328±n/a nM
Comments
extracted
Citation
 Bombrun, ASchwarz, MCrosignani, SCovini, DMarin, D 6-amino-pyrimidine-4-carboxamide derivatives and related compounds which bind to the sphingosine 1-phosphate (S1P) receptor for the treatment of multiple sclerosis US Patent  US9150519 Publication Date 10/6/2015 
Target
Name:
Sphingosine 1-phosphate receptor 1
Synonyms:
CHEDG1 Endothelial differentiation G-protein coupled receptor 1 S1P1 S1PR1_HUMAN Sphingosine 1-phosphate receptor Edg-1
Type:
Enzyme
Mol. Mass.:
42836.02
Organism:
Homo sapiens (Human)
Description:
P21453
Residue:
382
  
Inhibitor
Name:
BDBM183683
Synonyms:
US9150519, 1-78
Type:
Small organic molecule
Emp. Form.:
C26H36N6O
Mol. Mass.:
448.6036
SMILES:
O=C(Nc1ccc(CN2CCNCC2)cc1)c1cc(ncn1)N(CC1CC1)C1CCCCC1
: