Target
Acetyl-CoA carboxylase 2
Ligand
BDBM186776
Substrate
Meas. Tech.
Spectrophotometric 384 Well Assay
pH
7.5±n/a
IC50
55±n/a nM
Comments
extracted
Citation
 Fleck, MHeine, NNosse, BRoth, GJHeimann, A Pyrrolidine derivatives, pharmaceutical compositions and uses thereof US Patent  US9169205 Publication Date 10/27/2015 
Target
Name:
Acetyl-CoA carboxylase 2
Synonyms:
ACACB ACC-beta ACCB Acetyl-CoA carboxylase 2 Acetyl-CoA carboxylase 2 (ACC2)
Type:
Protein
Mol. Mass.:
276535.21
Organism:
Homo sapiens (Human)
Description:
O00763
Residue:
2458
  
Inhibitor
Name:
BDBM186776
Synonyms:
US9169205, 3.2
Type:
Small organic molecule
Emp. Form.:
C25H33N3O3
Mol. Mass.:
423.5478
SMILES:
CCNC(=O)N[C@@H](C)c1ccc(OC2CCN(C2)c2ccc(OCC3CC3)cc2)cc1
: