Target
5-hydroxytryptamine receptor 2B
Ligand
BDBM186945
Substrate
Meas. Tech.
Radioligand Binding Assay
pH
7.4±n/a
Ki
1326±n/a nM
Comments
extracted
Citation
 Besnard, JHopkins, ALGilbert, IRuda, GFAbecassis, K Morpholino compounds, uses and methods US Patent  US9079895 Publication Date 7/14/2015 
Target
Name:
5-hydroxytryptamine receptor 2B
Synonyms:
5-HT2 5-hydroxytryptamine receptor 2B 5HT2B_MOUSE Htr2b
Type:
Enzyme
Mol. Mass.:
53610.91
Organism:
Mus musculus (Mouse)
Description:
Q02152
Residue:
479
  
Inhibitor
Name:
BDBM186945
Synonyms:
US9079895, 29r
Type:
Small organic molecule
Emp. Form.:
C22H29N3O2
Mol. Mass.:
367.4846
SMILES:
Cc1ccnc(C)c1OC[C@H]1CN(CCN2CCc3ccccc23)CCO1
: