Target
Fatty-acid amide hydrolase 1
Ligand
BDBM188368
Substrate
Meas. Tech.
Biological Assay
pH
9±n/a
IC50
87±n/a nM
Comments
extracted
Citation
 Apodaca, RBreitenbucher, JGPattabiraman, KSeierstad, MXiao, W Piperazinyl and piperidinyl ureas as modulators of fatty acid amide hydrolase US Patent  US9169224 Publication Date 10/27/2015 
Target
Name:
Fatty-acid amide hydrolase 1
Synonyms:
Anandamide amidohydrolase FAAH FAAH1_HUMAN Fatty-acid amide hydrolase (FAAH) Oleamide hydrolase 1
Type:
Protein
Mol. Mass.:
63071.19
Organism:
Homo sapiens (Human)
Description:
O00519
Residue:
579
  
Inhibitor
Name:
BDBM188368
Synonyms:
US9169224, 52
Type:
Small organic molecule
Emp. Form.:
C19H19F2N3O3
Mol. Mass.:
375.3693
SMILES:
FC1(F)Oc2ccc(CN3CCN(CC3)C(=O)Nc3ccccc3)cc2O1
: