Target
Fatty-acid amide hydrolase 1
Ligand
BDBM188401
Substrate
Meas. Tech.
Biological Assay
pH
9±n/a
IC50
75±n/a nM
Comments
extracted
Citation
 Apodaca, RBreitenbucher, JGPattabiraman, KSeierstad, MXiao, W Piperazinyl and piperidinyl ureas as modulators of fatty acid amide hydrolase US Patent  US9169224 Publication Date 10/27/2015 
Target
Name:
Fatty-acid amide hydrolase 1
Synonyms:
Anandamide amidohydrolase FAAH FAAH1_HUMAN Fatty-acid amide hydrolase (FAAH) Oleamide hydrolase 1
Type:
Protein
Mol. Mass.:
63071.19
Organism:
Homo sapiens (Human)
Description:
O00519
Residue:
579
  
Inhibitor
Name:
BDBM188401
Synonyms:
US9169224, 90
Type:
Small organic molecule
Emp. Form.:
C19H21Br2N3O2
Mol. Mass.:
483.197
SMILES:
COc1ccc(NC(=O)N2CCN(Cc3ccc(Br)c(Br)c3)CC2)cc1
: