Target
Neutrophil elastase
Ligand
BDBM189924
Substrate
Meas. Tech.
Inhibition Assay
pH
7.4±n/a
Temperature
310.15±n/a K
IC50
<0.3±n/a nM
Comments
extracted
Citation
 Von Nussbaum, FKarthaus, DAnlauf, SDelbeck, MLi, VMMeibom, DLustig, KSchamberger, J 4-(4-cyano-2-thioaryl)dihydropyrimidinones and use thereof US Patent  US9174997 Publication Date 11/3/2015 
Target
Name:
Neutrophil elastase
Synonyms:
Bone marrow serine protease Coagulation factor X ELANE Elastase HLE Leukocyte elastase Medullasin Neutrophil elastase (HNE) PMN elastase Trypsin
Type:
Enzyme
Mol. Mass.:
28532.38
Organism:
Homo sapiens (Human)
Description:
P08246
Residue:
267
  
Inhibitor
Name:
BDBM189924
Synonyms:
US9174997, 144
Type:
Small organic molecule
Emp. Form.:
C24H22F3N3O8S2
Mol. Mass.:
601.572
SMILES:
CC1=C([C@H](N(C(=O)N1c1cccc(c1)C(F)(F)F)S(C)(=O)=O)c1ccc(cc1S(C)(=O)=O)C#N)C(=O)OCCO
: