Target
Prostaglandin E2 receptor EP4 subtype
Ligand
BDBM50101828
Substrate
Meas. Tech.
cAMP Assay
Temperature
310.15±n/a K
EC50
0.22±0.04 nM
Comments
extracted
Citation
 Barrett, SDCiske, FLColombo, JMEndres, GWGermain, BDKornilov, AKramer, JBUzieblo, AMaxey, KM Difluorolactam compounds as EP4 receptor-selective agonists for use in the treatment of EP4-mediated diseases and conditions US Patent  US9180116 Publication Date 11/10/2015 
Target
Name:
Prostaglandin E2 receptor EP4 subtype
Synonyms:
PE2R4_HUMAN PGE2 receptor EP4 subtype PTGER4 Prostanoid EP4 receptor
Type:
Enzyme
Mol. Mass.:
53134.53
Organism:
Homo sapiens (Human)
Description:
P35408
Residue:
488
  
Inhibitor
Name:
BDBM50101828
Synonyms:
7-[(1R,2R,3R)-3-Hydroxy-2-((E)-(R)-3-hydroxy-oct-1-enyl)-5-oxo-cyclopentyl]-heptanoic acid PGE1 | US9180116, PGE1
Type:
Small organic molecule
Emp. Form.:
C20H34O5
Mol. Mass.:
354.481
SMILES:
CCCCC[C@@H](O)\C=C\[C@H]1[C@H](O)CC(=O)[C@@H]1CCCCCCC(O)=O
: