Target
Serine/threonine-protein kinase pim-1
Ligand
BDBM192539
Substrate
Meas. Tech.
PIM Enzyme Assay
IC50
0.08±n/a nM
Citation
 D'amico, DCHerberich, BJJackson, CLPettus, LHTasker, AWang, HWu, BWurz, R Bicyclic pyridazine compounds as Pim inhibitors US Patent  US9187486 Publication Date 11/17/2015 
Target
Name:
Serine/threonine-protein kinase pim-1
Synonyms:
PIM-1 Kinase PIM1_HUMAN Serine/threonine-protein kinase (PIM1) Serine/threonine-protein kinase PIM1 | Serine/threonine-protein kinase pim-1 (PIM1)
Type:
Protein
Mol. Mass.:
35681.82
Organism:
Homo sapiens (Human)
Description:
P11309
Residue:
313
  
Inhibitor
Name:
BDBM192539
Synonyms:
US9187486, 1
Type:
Small organic molecule
Emp. Form.:
C22H21F2N7
Mol. Mass.:
421.4458
SMILES:
N[C@H]1CCCN(C1)c1ccncc1Nc1ncc2ccc(nn12)-c1c(F)cccc1F
: