Target
Mu-type opioid receptor
Ligand
BDBM199357
Substrate
Meas. Tech.
Radioligand Dose-Displacement Binding Assay
pH
7.4±n/a
Temperature
323.15±n/a K
Ki
1.33±0.42 nM
Comments
extracted
Citation
 Kyle, DJTafesse, L Buprenorphine analogs US Patent  US9221831 Publication Date 12/29/2015 
Target
Name:
Mu-type opioid receptor
Synonyms:
M-OR-1 MOR-1 MUOR1 Mu opiate receptor OPRM1 hMOP | mu-type opioid receptor isoform MOR-1
Type:
G Protein-Coupled Receptor (GPCR)
Mol. Mass.:
44789.51
Organism:
Homo sapiens (Human)
Description:
P35372
Residue:
400
  
Inhibitor
Name:
BDBM199357
Synonyms:
US9221831, 22
Type:
Small organic molecule
Emp. Form.:
C27H31NO4
Mol. Mass.:
433.5393
SMILES:
CO[C@]12CC[C@@]3(C[C@@H]1COCc1ccccc1)[C@H]1Cc4ccc(O)c5O[C@@H]2[C@]3(CCN1)c45
: