Target
Extracellular calcium-sensing receptor
Ligand
BDBM205500
Substrate
Meas. Tech.
Agonistic Activity Assay
pH
7.2±n/a
Temperature
310.15±n/a K
EC50
3±n/a nM
Comments
extracted
Citation
 Sugiki, MOkamatsu, TYano, TTaniguchi, S Alkylamine derivative US Patent  US9253997 Publication Date 2/9/2016 
Target
Name:
Extracellular calcium-sensing receptor
Synonyms:
CASR CaR Calcium-sensing receptor (CaSR) GPRC2A Parathyroid Cell calcium-sensing receptor Synonyms=GPRC2A | hCasR
Type:
Protein
Mol. Mass.:
120663.13
Organism:
Homo sapiens (Human)
Description:
P41180
Residue:
1078
  
Inhibitor
Name:
BDBM205500
Synonyms:
US9253997, 6
Type:
Small organic molecule
Emp. Form.:
C10H12ClN3O7S
Mol. Mass.:
353.736
SMILES:
N[C@@H](CNC(=O)Nc1cc(Cl)cc(c1O)S(O)(=O)=O)C(O)=O
: