Target
Angiopoietin-1 receptor
Ligand
BDBM5815
Substrate
biotinylated synthetic peptide
Meas. Tech.
Homogeneous Time-resolved Fluorescence (HTRF) Assay
pH
7.5±n/a
Temperature
295.15±n/a K
IC50
2±n/a nM
Citation
 Miyazaki, YMatsunaga, STang, JMaeda, YNakano, MPhilippe, RJShibahara, MLiu, WSato, HWang, LNolte, RT Novel 4-amino-furo[2,3-d]pyrimidines as Tie-2 and VEGFR2 dual inhibitors. Bioorg Med Chem Lett 15:2203-7 (2005)  
Target
Name:
Angiopoietin-1 receptor
Synonyms:
TEK TIE2_HUMAN Tyrosine-protein kinase receptor (TIE-2) Tyrosine-protein kinase receptor TEK (p140 TEK) Tyrosine-protein kinase receptor TIE2/TEK VMCM1 p140 TEK
Type:
Enzyme
Mol. Mass.:
125835.70
Organism:
Homo sapiens (Human)
Description:
Q02763
Residue:
1124
  
Inhibitor
Name:
BDBM5815
Synonyms:
3-{4-[4-amino-6-(4-methoxyphenyl)furo[2,3-d]pyrimidin-5-yl]phenyl}-1-[2-fluoro-5-(trifluoromethyl)phenyl]urea furo[2,3-d]pyrimidine deriv. 7k
Type:
Small organic molecule
Emp. Form.:
C27H19F4N5O3
Mol. Mass.:
537.4651
SMILES:
COc1ccc(cc1)-c1oc2ncnc(N)c2c1-c1ccc(NC(=O)Nc2cc(ccc2F)C(F)(F)F)cc1
:
Substrate
Name:
biotinylated synthetic peptide
Synonyms:
Type:
Peptide
Mol. Mass.:
3022.54
Organism:
Description:
80 uM ATP as co-substrate
Residue:
27