Target
Vascular endothelial growth factor receptor 2
Ligand
BDBM5828
Substrate
biotinylated synthetic peptide
Meas. Tech.
Homogeneous Time-resolved Fluorescence (HTRF) Assay
pH
7.5±n/a
Temperature
295.15±n/a K
IC50
1±n/a nM
Citation
 Sammond, DMNailor, KEVeal, JMNolte, RTWang, LKnick, VBRudolph, SKTruesdale, ATNartey, ENStafford, JAKumar, RCheung, M Discovery of a novel and potent series of dianilinopyrimidineurea and urea isostere inhibitors of VEGFR2 tyrosine kinase. Bioorg Med Chem Lett 15:3519-23 (2005)  
Target
Name:
Vascular endothelial growth factor receptor 2
Synonyms:
CD_antigen=CD309 Fetal liver kinase 1 (FLK-1) KDR Protein-tyrosine kinase receptor Flk-1 VEGFR-2 VEGFR2 Vascular Endothelial Growth Factor Receptor Kinase 2 Vascular endothelial growth factor receptor 2 (KDR) Vascular endothelial growth factor receptor 2 (VEGFR2) Vascular endothelial growth factor receptor-2 (VEGFR-2)
Type:
Receptor Tyrosine Kinase
Mol. Mass.:
151510.97
Organism:
Homo sapiens (Human)
Description:
P35968
Residue:
1356
  
Inhibitor
Name:
BDBM5828
Synonyms:
1-[2-fluoro-5-(trifluoromethyl)phenyl]-3-{4-[methyl({2-[(3-sulfamoylphenyl)amino]pyrimidin-4-yl})amino]phenyl}urea | urea deriv. 19
Type:
Small organic molecule
Emp. Form.:
C25H21F4N7O3S
Mol. Mass.:
575.538
SMILES:
CN(c1ccc(NC(=O)Nc2cc(ccc2F)C(F)(F)F)cc1)c1ccnc(Nc2cccc(c2)S(N)(=O)=O)n1
:
Substrate
Name:
biotinylated synthetic peptide
Synonyms:
Type:
Peptide
Mol. Mass.:
3433.86
Organism:
Description:
75 uM ATP as co-substrate.
Residue:
28