Target
Lysine-specific histone demethylase 1A
Ligand
BDBM283253
Substrate
Meas. Tech.
In Vitro Enzyme Inhibition Assay
Temperature
298.15±n/a K
IC50
<100±n/a nM
Comments
extracted
Citation
 Chen, YKKanouni, TKaldor, SWStafford, JAVeal, JM Inhibitors of lysine specific demethylase-1 US Patent  US9573930 Publication Date 2/21/2017 
Target
Name:
Lysine-specific histone demethylase 1A
Synonyms:
AOF2 Flavin-containing amine oxidase domain-containing protein 2 KDM1A KIAA0601 Lysine-specific demethylase 1 (LSD1) Lysine-specific histone demethylase 1 (LSD1)
Type:
Enzyme
Mol. Mass.:
92901.01
Organism:
Homo sapiens (Human)
Description:
O60341
Residue:
852
  
Inhibitor
Name:
BDBM283253
Synonyms:
4-[2-(4-aminopiperidyl)-5- (3,5-difluoro-4-methoxyphenyl)- 1-methyl-6-oxohydropyrimidin- 4-yl]benzenecarbonitrile US10207999, Example 38 US10548896, Example 38 US10960005, Example 38 US9573930, Example 38 US9776974, Example 38
Type:
Small organic molecule
Emp. Form.:
C24H23F2N5O2
Mol. Mass.:
451.4685
SMILES:
COc1c(F)cc(cc1F)-c1c(nc(N2CCC(N)CC2)n(C)c1=O)-c1ccc(cc1)C#N
: