Target
Ephrin type-A receptor 2 [596-900]
Ligand
BDBM209864
Substrate
Meas. Tech.
Kinobeads Competition Assay
Kd
484±0.0 nM
Citation
 Heinzlmeir, SKudlinzki, DSreeramulu, SKlaeger, SGande, SLLinhard, VWilhelm, MQiao, HHelm, DRuprecht, BSaxena, KMédard, GSchwalbe, HKuster, B Chemical Proteomics and Structural Biology Define EPHA2 Inhibition by Clinical Kinase Drugs. ACS Chem Biol 11:3400-3411 (2016)  
Target
Name:
Ephrin type-A receptor 2 [596-900]
Synonyms:
ECK EPHA2_HUMAN | Ephrin type-A receptor 2 (EPHA2)
Type:
Protein
Mol. Mass.:
34367.96
Organism:
Homo sapiens (Human)
Description:
EPHA2 truncation (596-900 aa); 519U
Residue:
305
  
Inhibitor
Name:
BDBM209864
Synonyms:
2-[(1R)-1-[(6-amino-5-chloropyrimidine-4-carbonyl)amino]ethyl]-N-[5-chloro-4-(trifluoromethyl)pyridin-2-yl]-1,3-thiazole-5-carboxamide | MLN-2480
Type:
Small organic molecule
Emp. Form.:
C17H12Cl2F3N7O2S
Mol. Mass.:
506.289
SMILES:
C[C@@H](NC(=O)c1ncnc(N)c1Cl)c1ncc(s1)C(=O)Nc1cc(c(Cl)cn1)C(F)(F)F
: