Target
Cannabinoid receptor 2
Ligand
BDBM210526
Substrate
Meas. Tech.
cAMP Assay
Temperature
310.15±n/a K
EC50
0.1±n/a nM
Comments
extracted
Citation
 Bissantz, CGrether, UHebeisen, PKimbara, ALiu, QNettekoven, MPrunotto, MRoever, SRogers-Evans, MSchulz-Gasch, TUllmer, CWang, ZYang, W Pyridine derivatives as agonists of the CB2 receptor US Patent  US9290451 Publication Date 3/22/2016 
Target
Name:
Cannabinoid receptor 2
Synonyms:
CANNABINOID CB2 CB2 CB2B CNR2_HUMAN Cannabinoid CB2 receptor Cannabinoid receptor 2 (CB2R) | hCB2
Type:
G Protein-Coupled Receptor (GPCR)
Mol. Mass.:
39690.94
Organism:
Homo sapiens (Human)
Description:
P34972
Residue:
360
  
Inhibitor
Name:
BDBM210526
Synonyms:
US9290451, 233
Type:
Small organic molecule
Emp. Form.:
C21H30N2O5
Mol. Mass.:
390.4733
SMILES:
CCC(CC)(NC(=O)c1ccc(C2CC2)c(OCC2CCCO2)n1)C(=O)OC
: