Target
Neutrophil elastase
Ligand
BDBM211780
Substrate
Meas. Tech.
Nuetrophil Elastase Acitivty Assay
pH
7.5±n/a
EC50
2±n/a nM
Comments
extracted
Citation
 Gnamm, COost, TPeters, SHoesch, HRies, UJ Substituted bicyclic dihydropyrimidinones and their use as inhibitors of neutrophil elastase activity US Patent  US9290459 Publication Date 3/22/2016 
Target
Name:
Neutrophil elastase
Synonyms:
Bone marrow serine protease Coagulation factor X ELANE Elastase HLE Leukocyte elastase Medullasin Neutrophil elastase (HNE) PMN elastase Trypsin
Type:
Enzyme
Mol. Mass.:
28532.38
Organism:
Homo sapiens (Human)
Description:
P08246
Residue:
267
  
Inhibitor
Name:
BDBM211780
Synonyms:
US9290459, 19 | US9670166, 19
Type:
Small organic molecule
Emp. Form.:
C24H18F3N3O6S
Mol. Mass.:
533.476
SMILES:
CS(=O)(=O)c1cc(ccc1C1N(CC(O)=O)C(=O)N(C2=C1C(=O)CC2)c1cccc(c1)C(F)(F)F)C#N
: