Target
Tyrosine-protein kinase BTK
Ligand
BDBM290210
Substrate
Meas. Tech.
Caliper-based kinase assay
Temperature
298.15±n/a K
IC50
0.700±n/a nM
Comments
extracted
Citation
 Babler, MGerritsen, ME Treatment of dry eye US Patent  US9572811 Publication Date 2/21/2017 
Target
Name:
Tyrosine-protein kinase BTK
Synonyms:
AGMX1 Agammaglobulinaemia tyrosine kinase B cell progenitor kinase BPK BTK_HUMAN Tyrosine Kinase BTK Tyrosine-protein kinase BTK (BTK)
Type:
Enzyme
Mol. Mass.:
76289.95
Organism:
Homo sapiens (Human)
Description:
Q06187
Residue:
659
  
Inhibitor
Name:
BDBM290210
Synonyms:
US9572811, Example 139A
Type:
Small organic molecule
Emp. Form.:
C36H41FN8O2
Mol. Mass.:
636.7615
SMILES:
CCN(CC)CC1(CCCC1)C=C(C#N)C(=O)N1CCC[C@H](C1)n1nc(-c2ccc(Oc3ccccc3)cc2F)c2c(N)ncnc12
: