Target
Tyrosine-protein kinase BTK
Ligand
BDBM197271
Substrate
Meas. Tech.
Caliper-based kinase assay
Temperature
298.15±n/a K
IC50
3.00±n/a nM
Comments
extracted
Citation
 Babler, MGerritsen, ME Treatment of dry eye US Patent  US9572811 Publication Date 2/21/2017 
Target
Name:
Tyrosine-protein kinase BTK
Synonyms:
AGMX1 Agammaglobulinaemia tyrosine kinase B cell progenitor kinase BPK BTK_HUMAN Tyrosine Kinase BTK Tyrosine-protein kinase BTK (BTK)
Type:
Enzyme
Mol. Mass.:
76289.95
Organism:
Homo sapiens (Human)
Description:
Q06187
Residue:
659
  
Inhibitor
Name:
BDBM197271
Synonyms:
US9090621, 184B | US9572811, Example 183B
Type:
Small organic molecule
Emp. Form.:
C29H30FN7O3
Mol. Mass.:
543.592
SMILES:
CCOC(C)(C)C=C(C#N)C(=O)N[C@H](C)Cn1nc(-c2ccc(Oc3ccccc3)cc2F)c2c(N)ncnc12
: