Target
Tyrosine-protein kinase BTK
Ligand
BDBM290221
Substrate
Meas. Tech.
Caliper-based kinase assay
Temperature
298.15±n/a K
IC50
3.70±n/a nM
Comments
extracted
Citation
 Babler, MGerritsen, ME Treatment of dry eye US Patent  US9572811 Publication Date 2/21/2017 
Target
Name:
Tyrosine-protein kinase BTK
Synonyms:
AGMX1 Agammaglobulinaemia tyrosine kinase B cell progenitor kinase BPK BTK_HUMAN Tyrosine Kinase BTK Tyrosine-protein kinase BTK (BTK)
Type:
Enzyme
Mol. Mass.:
76289.95
Organism:
Homo sapiens (Human)
Description:
Q06187
Residue:
659
  
Inhibitor
Name:
BDBM290221
Synonyms:
US9572811, Example 186
Type:
Small organic molecule
Emp. Form.:
C30H29FN8O2
Mol. Mass.:
552.6021
SMILES:
Nc1ncnc2n(C[C@H]3CCCN3C(=O)C(=C[C@H]3CCCN3)C#N)nc(-c3ccc(Oc4ccccc4)cc3F)c12
: