Target
Histone-lysine N-methyltransferase EZH2
Ligand
BDBM155255
Substrate
Meas. Tech.
Wild-Type and Mutant PRC2 Enzyme Assays
IC50
<10±0.0 nM
Citation
 Kuntz, KWCampbell, JESeki, M Substituted benzene compounds US Patent  US10098888 Publication Date 10/16/2018 
Target
Name:
Histone-lysine N-methyltransferase EZH2
Synonyms:
ENX-1 EZH2_HUMAN Histone-lysine N-methyltransferase EZH2 Lysine N-methyltransferase 6
Type:
Protein
Mol. Mass.:
85367.84
Organism:
Homo sapiens (Human)
Description:
Q15910
Residue:
746
  
Inhibitor
Name:
BDBM155255
Synonyms:
US10098888, Compound 105 US9006242, 105
Type:
Small organic molecule
Emp. Form.:
C31H42N4O3
Mol. Mass.:
518.6902
SMILES:
CCN(C1CCOCC1)c1cc(cc(C(=O)NCc2c(C)cc(C)[nH]c2=O)c1C)C#CC1CCN(C)CC1
: