Target
Cystic fibrosis transmembrane conductance regulator
Ligand
BDBM221981
Substrate
Meas. Tech.
IonWorks Quattro Assay
IC50
3.24±n/a nM
Citation
 Ahmed, MAshall-Kelly, ABloomfield, GCGueritz, LMcKenna, JMcKenna, JMutton, SParmar, RSheperd, JWright, P Substituted pyrazino[1′,2′:1,2]pyrrolo[3,4-d]pyrimidines, pyrimido[4′,5′:3,4]pyrrolo[2,1-c][1,4]oxazines and pyrimido[4′,5′:3,4]pyrrolo[1,2-d][1,4]oxazepines for inhibiting the CFTR channel US Patent  US9303035 Publication Date 4/5/2016 
Target
Name:
Cystic fibrosis transmembrane conductance regulator
Synonyms:
cystic fibrosis transmembrane conductance regulator protein (CFTR)
Type:
Protein
Mol. Mass.:
125499.86
Organism:
Cricetulus griseus (Chinese hamster)
Description:
G3H9J3
Residue:
1107
  
Inhibitor
Name:
BDBM221981
Synonyms:
US9303035, 5.1
Type:
Small organic molecule
Emp. Form.:
C22H22N4O3S
Mol. Mass.:
422.5
SMILES:
C[C@@H]1COC(c2nc(C)cs2)c2n1c(-c1ccccc1)c1c2n(C)c(=O)n(C)c1=O
: