Target
Tyrosine-protein kinase SYK
Ligand
BDBM290676
Substrate
Meas. Tech.
In Vitro Assay
pH
7.5±n/a
Temperature
298.15±n/a K
IC50
5.5±n/a nM
Comments
extracted
Citation
 Jia, ZJVenkataramani, CHuang, WMehrotra, MSong, YXu, QBauer, SMRose, JWKane, BPandey, A Inhibitors of syk and JAK protein kinases US Patent  US9579320 Publication Date 2/28/2017 
Target
Name:
Tyrosine-protein kinase SYK
Synonyms:
KSYK_HUMAN Spleen Tyrosine Kinase Tyrosine-protein kinase SYK (Syk)
Type:
Enzyme
Mol. Mass.:
72079.99
Organism:
Homo sapiens (Human)
Description:
P43405
Residue:
635
  
Inhibitor
Name:
BDBM290676
Synonyms:
2-((1R,2S)-2-aminocyclohexylamino)-4-(3-methoxy-5-(1H-tetrazol-1-yl)phenylamino)pyrimidine-5-carboxamide | US9579320, Example 65
Type:
Small organic molecule
Emp. Form.:
C19H24N10O2
Mol. Mass.:
424.4597
SMILES:
COc1cc(Nc2nc(N[C@@H]3CCCC[C@@H]3N)ncc2C(N)=O)cc(c1)-n1cnnn1
: