Target
Tyrosine-protein kinase SYK
Ligand
BDBM290815
Substrate
Meas. Tech.
In Vitro Assay
pH
7.5±n/a
Temperature
298.15±n/a K
IC50
5.5±n/a nM
Comments
extracted
Citation
 Jia, ZJVenkataramani, CHuang, WMehrotra, MSong, YXu, QBauer, SMRose, JWKane, BPandey, A Inhibitors of syk and JAK protein kinases US Patent  US9579320 Publication Date 2/28/2017 
Target
Name:
Tyrosine-protein kinase SYK
Synonyms:
KSYK_HUMAN Spleen Tyrosine Kinase Tyrosine-protein kinase SYK (Syk)
Type:
Enzyme
Mol. Mass.:
72079.99
Organism:
Homo sapiens (Human)
Description:
P43405
Residue:
635
  
Inhibitor
Name:
BDBM290815
Synonyms:
(S)-2-(2-aminopropylamino)-4-(3-(pyrimidin-2-yl)phenylamino)pyrimidine-5-carboxamide | US9579320, Example 215
Type:
Small organic molecule
Emp. Form.:
C21H23BrN6O
Mol. Mass.:
455.351
SMILES:
N[C@H]1CCCC[C@H]1Nc1ncc(C(N)=O)c(Nc2ccc3cc(Br)ccc3c2)n1
: