Target
Tyrosine-protein kinase SYK
Ligand
BDBM290831
Substrate
Meas. Tech.
In Vitro Assay
pH
7.5±n/a
Temperature
298.15±n/a K
IC50
5.5±n/a nM
Comments
extracted
Citation
 Jia, ZJVenkataramani, CHuang, WMehrotra, MSong, YXu, QBauer, SMRose, JWKane, BPandey, A Inhibitors of syk and JAK protein kinases US Patent  US9579320 Publication Date 2/28/2017 
Target
Name:
Tyrosine-protein kinase SYK
Synonyms:
KSYK_HUMAN Spleen Tyrosine Kinase Tyrosine-protein kinase SYK (Syk)
Type:
Enzyme
Mol. Mass.:
72079.99
Organism:
Homo sapiens (Human)
Description:
P43405
Residue:
635
  
Inhibitor
Name:
BDBM290831
Synonyms:
2-((1R,2S)-2-aminocyclohexylamino)-4-(1-ethyl-1H-indol-4-ylamino)pyrimidine-5-carboxamide | US9579320, Example 231
Type:
Small organic molecule
Emp. Form.:
C21H27N7O
Mol. Mass.:
393.4854
SMILES:
CCn1ccc2c(Nc3nc(N[C@@H]4CCCC[C@@H]4N)ncc3C(N)=O)cccc12
: