Target
Tyrosine-protein kinase SYK
Ligand
BDBM291029
Substrate
Meas. Tech.
In Vitro Assay
pH
7.5±n/a
Temperature
298.15±n/a K
IC50
5.5±n/a nM
Comments
extracted
Citation
 Jia, ZJVenkataramani, CHuang, WMehrotra, MSong, YXu, QBauer, SMRose, JWKane, BPandey, A Inhibitors of syk and JAK protein kinases US Patent  US9579320 Publication Date 2/28/2017 
Target
Name:
Tyrosine-protein kinase SYK
Synonyms:
KSYK_HUMAN Spleen Tyrosine Kinase Tyrosine-protein kinase SYK (Syk)
Type:
Enzyme
Mol. Mass.:
72079.99
Organism:
Homo sapiens (Human)
Description:
P43405
Residue:
635
  
Inhibitor
Name:
BDBM291029
Synonyms:
(R)-2-(2-amino-3-methoxypropylamino)-4-(1H-indol-4-ylamino)pyrimidine-5-carboxamide | US9579320, Example 485
Type:
Small organic molecule
Emp. Form.:
C17H21N7O2
Mol. Mass.:
355.3943
SMILES:
COC[C@H](N)CNc1ncc(C(N)=O)c(Nc2cccc3[nH]ccc23)n1
: