Target
Ephrin type-A receptor 4 [29-209]
Ligand
BDBM223308
Substrate
Meas. Tech.
Fluorescence Polarization Assay
pH
7.2±n/a
Temperature
298.15±n/a K
Ki
2570±n/a nM
Comments
extracted
Citation
 Wu, BDe, SKKulinich, ASalem, AFKoeppen, JWang, RBarile, EWang, SZhang, DEthell, IPellecchia, M Potent and Selective EphA4 Agonists for the Treatment of ALS. Cell Chem Biol 24:293-305 (2017)  
Target
Name:
Ephrin type-A receptor 4 [29-209]
Synonyms:
EPHA4 Ephrin type-A receptor 4 ligand binding domain (EphA4-LBD) SEK | TYRO1
Type:
Protein
Mol. Mass.:
20850.44
Organism:
Homo sapiens (Human)
Description:
Human EphA4-LBD (29-209 aa)
Residue:
181
  
Inhibitor
Name:
BDBM223308
Synonyms:
123C5
Type:
Small organic molecule
Emp. Form.:
C42H45ClN8O6
Mol. Mass.:
793.31
SMILES:
NCCCC(=O)N[C@@H](Cc1c[nH]c2ccc(O)cc12)C(=O)N[C@@H](Cc1ccc(Cl)cc1)C(=O)N[C@@H](Cc1ccncc1)C(=O)NCCc1c[nH]c2ccc(O)cc12
: