Target
Ephrin type-A receptor 3 [29-207]
Ligand
BDBM223311
Substrate
Meas. Tech.
Isothermal Titration Calorimetry (ITC)
pH
6.5±0
Temperature
300.15±0 K
Kd
4550±1090 nM
Citation
 Wu, BDe, SKKulinich, ASalem, AFKoeppen, JWang, RBarile, EWang, SZhang, DEthell, IPellecchia, M Potent and Selective EphA4 Agonists for the Treatment of ALS. Cell Chem Biol 24:293-305 (2017)  
Target
Name:
Ephrin type-A receptor 3 [29-207]
Synonyms:
EPHA3 ETK Ephrin type-A receptor 3 ligand binding domain (EphA3-LBD) TYRO4
Type:
Protein
Mol. Mass.:
20707.76
Organism:
Homo sapiens (Human)
Description:
Human EphA3-LBD (29-207 aa)
Residue:
179
  
Inhibitor
Name:
BDBM223311
Synonyms:
123C4
Type:
Small organic molecule
Emp. Form.:
C43H47ClN8O6
Mol. Mass.:
807.336
SMILES:
COc1ccc2[nH]cc(CCNC(=O)[C@H](Cc3ccncc3)NC(=O)[C@H](Cc3ccc(Cl)cc3)NC(=O)[C@H](Cc3c[nH]c4ccc(O)cc34)NC(=O)CCCN)c2c1
: