Target
Caspase-5
Ligand
BDBM50009859
Substrate
Meas. Tech.
Caspase Catalytic Activity Assay
pH
7.4±n/a
IC50
8.1e+3± 5e+2 nM
Comments
extracted
Citation
 Smith, CESoti, SJones, TANakagawa, AXue, DYin, H Non-steroidal Anti-inflammatory Drugs Are Caspase Inhibitors. Cell Chem Biol 24:281-292 (2017)  
Target
Name:
Caspase-5
Synonyms:
CASP-5 CASP5_HUMAN Caspase-5 subunit p10 ICE(rel)-III ICH3 Protease TY | TY protease
Type:
Enzyme
Mol. Mass.:
49760.80
Organism:
Homo sapiens (Human)
Description:
P51878
Residue:
434
  
Inhibitor
Name:
BDBM50009859
Synonyms:
(+-)-2-(p-isobutylphenyl)propionic acid (+-)-ibuprofen (4-isobutylphenyl)-alpha-methylacetic acid 2-(4-isobutylphenyl)propanoic acid 4-isobutylhydratropic acid Brufen IBUPROFEN LYSINE Ibuprofen (1) alpha-(4-isobutylphenyl)propionic acid | alpha-(p-isobutylphenyl)propionic acid
Type:
Small organic molecule
Emp. Form.:
C13H18O2
Mol. Mass.:
206.2808
SMILES:
CC(C)Cc1ccc(cc1)C(C)C(O)=O
: