Target
Ubiquitin carboxyl-terminal hydrolase 2 [258-605]
Ligand
BDBM53721
Substrate
Meas. Tech.
Di-UB K63-2 Hydrolysis Assay
IC50
>1.00e+5±n/a nM
Citation
 Magiera, KTomala, MKubica, KDe Cesare, VTrost, MZieba, BJKachamakova-Trojanowska, NLes, MDubin, GHolak, TASkalniak, L Lithocholic Acid Hydroxyamide Destabilizes Cyclin D1 and Induces G0/G1 Arrest by Inhibiting Deubiquitinase USP2a. Cell Chem Biol 24:458-470 (2017)  
Target
Name:
Ubiquitin carboxyl-terminal hydrolase 2 [258-605]
Synonyms:
UBP2_HUMAN USP2 | Ubiquitin-specific peptidase 2a (USP2a)
Type:
Enzyme
Mol. Mass.:
40094.16
Organism:
Homo sapiens (Human)
Description:
Hman USP2a (258-605 aa)
Residue:
348
  
Inhibitor
Name:
BDBM53721
Synonyms:
(4R)-4-[(3R,5S,7S,8R,9S,10S,13R,14S,17R)-10,13-dimethyl-3,7-bis(oxidanyl)-2,3,4,5,6,7,8,9,11,12,14,15,16,17-tetradecahydro-1H-cyclopenta[a]phenanthren-17-yl]pentanoic acid (4R)-4-[(3R,5S,7S,8R,9S,10S,13R,14S,17R)-3,7-dihydroxy-10,13-dimethyl-2,3,4,5,6,7,8,9,11,12,14,15,16,17-tetradecahydro-1H-cyclopenta[a]phenanthren-17-yl]valeric acid 3alpha,7beta-dihydroxycholanic acid CHEMBL1551 SMR000058403 URSODEOXYCHOLIC ACID Urso 250 Ursodesoxycholic Acid ursodeoxycholicacid
Type:
Small organic molecule
Emp. Form.:
C24H40O4
Mol. Mass.:
392.572
SMILES:
C[C@H](CCC(O)=O)[C@H]1CC[C@H]2[C@@H]3[C@@H](O)C[C@@H]4C[C@H](O)CC[C@]4(C)[C@H]3CC[C@]12C
: