Target
Histone-lysine N-methyltransferase SETD7
Ligand
BDBM225230
Substrate
Meas. Tech.
HMT Assay
IC50
>1.00e+5±n/a nM
Citation
 Qi, WZhao, KGu, JHuang, YWang, YZhang, HZhang, MZhang, JYu, ZLi, LTeng, LChuai, SZhang, CZhao, MChan, HChen, ZFang, DFei, QFeng, LFeng, LGao, YGe, HGe, XLi, GLingel, ALin, YLiu, YLuo, FShi, MWang, LWang, ZYu, YZeng, JZeng, CZhang, LZhang, QZhou, SOyang, CAtadja, PLi, E An allosteric PRC2 inhibitor targeting the H3K27me3 binding pocket of EED. Nat Chem Biol 13:381-388 (2017)  
Target
Name:
Histone-lysine N-methyltransferase SETD7
Synonyms:
Histone-lysine N-methyltransferase SETD7 KMT7 SET7 SETD7 | SETD7_HUMAN
Type:
Enzyme
Mol. Mass.:
40691.12
Organism:
Homo sapiens (Human)
Description:
Q8WTS6
Residue:
366
  
Inhibitor
Name:
BDBM225230
Synonyms:
EED226 | US11013745, Compound EED226
Type:
Small organic molecule
Emp. Form.:
C17H15N5O3S
Mol. Mass.:
369.398
SMILES:
CS(=O)(=O)c1ccc(cc1)-c1cnc(NCc2ccco2)n2cnnc12
: