Target
Histone-lysine N-methyltransferase NSD2
Ligand
BDBM225230
Substrate
Meas. Tech.
HMT Assay
IC50
>1.00e+5±n/a nM
Citation
 Qi, WZhao, KGu, JHuang, YWang, YZhang, HZhang, MZhang, JYu, ZLi, LTeng, LChuai, SZhang, CZhao, MChan, HChen, ZFang, DFei, QFeng, LFeng, LGao, YGe, HGe, XLi, GLingel, ALin, YLiu, YLuo, FShi, MWang, LWang, ZYu, YZeng, JZeng, CZhang, LZhang, QZhou, SOyang, CAtadja, PLi, E An allosteric PRC2 inhibitor targeting the H3K27me3 binding pocket of EED. Nat Chem Biol 13:381-388 (2017)  
Target
Name:
Histone-lysine N-methyltransferase NSD2
Synonyms:
KIAA1090 NSD2 Nuclear SET domain-containing protein 2 (NSD2) WHSC1
Type:
Protein
Mol. Mass.:
152327.31
Organism:
Homo sapiens (Human)
Description:
O96028
Residue:
1365
  
Inhibitor
Name:
BDBM225230
Synonyms:
EED226 | US11013745, Compound EED226
Type:
Small organic molecule
Emp. Form.:
C17H15N5O3S
Mol. Mass.:
369.398
SMILES:
CS(=O)(=O)c1ccc(cc1)-c1cnc(NCc2ccco2)n2cnnc12
: