Target
Methylosome protein 50/Protein arginine N-methyltransferase 5
Ligand
BDBM225230
Substrate
Meas. Tech.
HMT Assay
IC50
>1.00e+5±n/a nM
Citation
 Qi, WZhao, KGu, JHuang, YWang, YZhang, HZhang, MZhang, JYu, ZLi, LTeng, LChuai, SZhang, CZhao, MChan, HChen, ZFang, DFei, QFeng, LFeng, LGao, YGe, HGe, XLi, GLingel, ALin, YLiu, YLuo, FShi, MWang, LWang, ZYu, YZeng, JZeng, CZhang, LZhang, QZhou, SOyang, CAtadja, PLi, E An allosteric PRC2 inhibitor targeting the H3K27me3 binding pocket of EED. Nat Chem Biol 13:381-388 (2017)  
Target
Name:
Methylosome protein 50/Protein arginine N-methyltransferase 5
Synonyms:
PRMT5 PRMT5/MEP50 Enzyme | PRMT5/MEP50 complex
Type:
Protein
Mol. Mass.:
Description:
Components:
This complex has 2 components.
Component 1
Name:
Protein arginine N-methyltransferase 5
Synonyms:
72 kDa ICln-binding protein HRMT1L5 IBP72 Jak-binding protein 1 PRMT5/MEP50 complex Protein arginine methyltransferase 5 (PRMT5) SKB1 homolog Shk1 kinase-binding protein 1 homolog
Type:
Enzyme
Mol. Mass.:
72679.99
Organism:
Homo sapiens (Human)
Description:
O14744
Residue:
637
  
Component 2
Name:
Methylosome protein 50
Synonyms:
Androgen receptor cofactor p44 MEP50 Nbla10071 WD45 p44/Mep50
Type:
Enzyme
Mol. Mass.:
36713.38
Organism:
Homo sapiens (Human)
Description:
Q9BQA1
Residue:
342
  
Inhibitor
Name:
BDBM225230
Synonyms:
EED226 | US11013745, Compound EED226
Type:
Small organic molecule
Emp. Form.:
C17H15N5O3S
Mol. Mass.:
369.398
SMILES:
CS(=O)(=O)c1ccc(cc1)-c1cnc(NCc2ccco2)n2cnnc12
: