Target
Nuclear receptor subfamily 1 group I member 2
Ligand
BDBM225230
Substrate
Meas. Tech.
HMT Assay
IC50
>3.0e+4±n/a nM
Citation
 Qi, WZhao, KGu, JHuang, YWang, YZhang, HZhang, MZhang, JYu, ZLi, LTeng, LChuai, SZhang, CZhao, MChan, HChen, ZFang, DFei, QFeng, LFeng, LGao, YGe, HGe, XLi, GLingel, ALin, YLiu, YLuo, FShi, MWang, LWang, ZYu, YZeng, JZeng, CZhang, LZhang, QZhou, SOyang, CAtadja, PLi, E An allosteric PRC2 inhibitor targeting the H3K27me3 binding pocket of EED. Nat Chem Biol 13:381-388 (2017)  
Target
Name:
Nuclear receptor subfamily 1 group I member 2
Synonyms:
NR1I2 Orphan nuclear receptor PAR1 PXR SXR nuclear receptor subfamily 1 group I member 2 isoform 1
Type:
Nuclear receptor
Mol. Mass.:
49774.77
Organism:
Homo sapiens (Human)
Description:
O75469
Residue:
434
  
Inhibitor
Name:
BDBM225230
Synonyms:
EED226 | US11013745, Compound EED226
Type:
Small organic molecule
Emp. Form.:
C17H15N5O3S
Mol. Mass.:
369.398
SMILES:
CS(=O)(=O)c1ccc(cc1)-c1cnc(NCc2ccco2)n2cnnc12
: