Target
Cyclin-dependent kinase 2
Ligand
BDBM225317
Substrate
Meas. Tech.
OctetRed_Method2
Kd
191±36.2 nM
Citation
 D3R, DD CSAR CDK2-CyclinA D3R 219:0 (2015) Target
Name:
Cyclin-dependent kinase 2
Synonyms:
CDK2 CDK2_HUMAN Cell division protein kinase 2 Protein cereblon/Cyclin-dependent kinase 2 | p33 protein kinase
Type:
Enzyme Subunit
Mol. Mass.:
33938.17
Organism:
Homo sapiens (Human)
Description:
P24941
Residue:
298
  
Inhibitor
Name:
BDBM225317
Synonyms:
CS242
Type:
Small Organic Molecule
Emp. Form.:
C14H11N7O3S
Mol. Mass.:
357.347
SMILES:
NS(=O)(=O)c1ccc(N\N=C2/C(=O)Nc3ccc4[nH]nnc4c23)cc1
: