Target
Cyclin-dependent kinase 2
Ligand
BDBM225314
Substrate
Meas. Tech.
OctetRed_Method1
Kd
58300±44500 nM
Citation
 D3R, DD CSAR CDK2 Kinase D3R 220:0 (2015) Target
Name:
Cyclin-dependent kinase 2
Synonyms:
CDK2 CDK2_HUMAN Cell division protein kinase 2 Protein cereblon/Cyclin-dependent kinase 2 | p33 protein kinase
Type:
Enzyme Subunit
Mol. Mass.:
33938.17
Organism:
Homo sapiens (Human)
Description:
P24941
Residue:
298
  
Inhibitor
Name:
BDBM225314
Synonyms:
CS9
Type:
Small Organic Molecule
Emp. Form.:
C15H14F3N3O2
Mol. Mass.:
325.2858
SMILES:
FC(F)(F)Oc1ccc(CC(=O)Nc2cc([nH]n2)C2CC2)cc1
: