Target
Cyclin-dependent kinase 2
Ligand
BDBM225316
Substrate
Meas. Tech.
OctetRed_Method1
Kd
287±35.1 nM
Citation
 D3R, DD CSAR CDK2 Kinase D3R 220:0 (2015) Target
Name:
Cyclin-dependent kinase 2
Synonyms:
CDK2 CDK2_HUMAN Cell division protein kinase 2 Protein cereblon/Cyclin-dependent kinase 2 | p33 protein kinase
Type:
Enzyme Subunit
Mol. Mass.:
33938.17
Organism:
Homo sapiens (Human)
Description:
P24941
Residue:
298
  
Inhibitor
Name:
BDBM225316
Synonyms:
CS241
Type:
Small Organic Molecule
Emp. Form.:
C16H15N5O3S
Mol. Mass.:
357.387
SMILES:
NC(=N)NS(=O)(=O)c1ccc(N\C=C2/C(=O)Nc3ccccc23)cc1
: