Target
Cyclin-dependent kinase 2
Ligand
BDBM225319
Substrate
Meas. Tech.
OctetRed_Method1
Kd
229±79.1 nM
Citation
 D3R, DD CSAR CDK2 Kinase D3R 220:0 (2015) Target
Name:
Cyclin-dependent kinase 2
Synonyms:
CDK2 CDK2_HUMAN Cell division protein kinase 2 Protein cereblon/Cyclin-dependent kinase 2 | p33 protein kinase
Type:
Enzyme Subunit
Mol. Mass.:
33938.17
Organism:
Homo sapiens (Human)
Description:
P24941
Residue:
298
  
Inhibitor
Name:
BDBM225319
Synonyms:
CS245
Type:
Small Organic Molecule
Emp. Form.:
C18H13N3O3S2
Mol. Mass.:
383.444
SMILES:
O=C1Nc2ccc3ncsc3c2\C1=C\Nc1ccc2CS(=O)(=O)Cc2c1
: