Target
Cyclin-dependent kinase 2
Ligand
BDBM225322
Substrate
Meas. Tech.
OctetRed_Method1
Kd
1060±227 nM
Citation
 D3R, DD CSAR CDK2 Kinase D3R 220:0 (2015) Target
Name:
Cyclin-dependent kinase 2
Synonyms:
CDK2 CDK2_HUMAN Cell division protein kinase 2 Protein cereblon/Cyclin-dependent kinase 2 | p33 protein kinase
Type:
Enzyme Subunit
Mol. Mass.:
33938.17
Organism:
Homo sapiens (Human)
Description:
P24941
Residue:
298
  
Inhibitor
Name:
BDBM225322
Synonyms:
CS248
Type:
Small Organic Molecule
Emp. Form.:
C19H23N4O3S
Mol. Mass.:
387.475
SMILES:
C[NH+](C)CCNS(=O)(=O)c1ccc(N\C=C2/C(=O)Nc3ccccc23)cc1
: