Target
Cyclin-dependent kinase 2
Ligand
BDBM225325
Substrate
Meas. Tech.
OctetRed_Method1
Kd
47.3±11.3 nM
Citation
 D3R, DD CSAR CDK2 Kinase D3R 220:0 (2015) Target
Name:
Cyclin-dependent kinase 2
Synonyms:
CDK2 CDK2_HUMAN Cell division protein kinase 2 Protein cereblon/Cyclin-dependent kinase 2 | p33 protein kinase
Type:
Enzyme Subunit
Mol. Mass.:
33938.17
Organism:
Homo sapiens (Human)
Description:
P24941
Residue:
298
  
Inhibitor
Name:
BDBM225325
Synonyms:
CS262
Type:
Small Organic Molecule
Emp. Form.:
C19H20N4O5S
Mol. Mass.:
416.451
SMILES:
CC(C)COC(=O)c1ccc2NC(=O)\C(=N/Nc3ccc(cc3)S(N)(=O)=O)c2c1
: