Target
Cyclin-dependent kinase 2
Ligand
BDBM91804
Substrate
Meas. Tech.
OctetRed_Method1
Kd
>100000±n/a nM
Citation
 D3R, DD CSAR CDK2 Kinase D3R 220:0 (2015) Target
Name:
Cyclin-dependent kinase 2
Synonyms:
CDK2 CDK2_HUMAN Cell division protein kinase 2 Protein cereblon/Cyclin-dependent kinase 2 | p33 protein kinase
Type:
Enzyme Subunit
Mol. Mass.:
33938.17
Organism:
Homo sapiens (Human)
Description:
P24941
Residue:
298
  
Inhibitor
Name:
BDBM91804
Synonyms:
CS67
Type:
Emp. Form.:
C25H23N3O4S
Mol. Mass.:
461.533
SMILES:
COc1ccc(cc1)C(=O)CSc1nnc(-c2ccc(OC)c(OC)c2)n1-c1ccccc1
: