Target
Serine/threonine-protein kinase pim-1
Ligand
BDBM227267
Substrate
Meas. Tech.
PIM Kinase Binding Assay
pH
7.2±n/a
Temperature
298.15±n/a K
Ki
0.00224±n/a nM
Comments
extracted
Citation
 Burch, JSun, MWang, XBlackaby, WHodges, AJSharpe, A Cyclic ether pyrazol-4-yl-heterocyclyl-carboxamide compounds and methods of use US Patent  US9328106 Publication Date 5/3/2016 
Target
Name:
Serine/threonine-protein kinase pim-1
Synonyms:
PIM-1 Kinase PIM1_HUMAN Serine/threonine-protein kinase (PIM1) Serine/threonine-protein kinase PIM1 | Serine/threonine-protein kinase pim-1 (PIM1)
Type:
Protein
Mol. Mass.:
35681.82
Organism:
Homo sapiens (Human)
Description:
P11309
Residue:
313
  
Inhibitor
Name:
BDBM227267
Synonyms:
US9328106, 218
Type:
Small organic molecule
Emp. Form.:
C24H26F3N5O4S
Mol. Mass.:
537.555
SMILES:
Cn1ncc(NC(=O)c2csc(n2)-c2c(F)cc(O[C@H]3CCOC3)cc2F)c1[C@@H]1CC[C@@H](N)[C@H](F)CO1
: