Target
Serine/threonine-protein kinase pim-1
Ligand
BDBM227278
Substrate
Meas. Tech.
PIM Kinase Binding Assay
pH
7.2±n/a
Temperature
298.15±n/a K
Ki
0.001±n/a nM
Comments
extracted
Citation
 Burch, JSun, MWang, XBlackaby, WHodges, AJSharpe, A Cyclic ether pyrazol-4-yl-heterocyclyl-carboxamide compounds and methods of use US Patent  US9328106 Publication Date 5/3/2016 
Target
Name:
Serine/threonine-protein kinase pim-1
Synonyms:
PIM-1 Kinase PIM1_HUMAN Serine/threonine-protein kinase (PIM1) Serine/threonine-protein kinase PIM1 | Serine/threonine-protein kinase pim-1 (PIM1)
Type:
Protein
Mol. Mass.:
35681.82
Organism:
Homo sapiens (Human)
Description:
P11309
Residue:
313
  
Inhibitor
Name:
BDBM227278
Synonyms:
US9328106, 229
Type:
Small organic molecule
Emp. Form.:
C21H22F3N5O3S
Mol. Mass.:
481.491
SMILES:
COc1ccc(F)c(-c2nc(cs2)C(=O)Nc2cnn(C)c2[C@@H]2CC[C@@H](N)[C@H](F)CO2)c1F
: