Target
Serine/threonine-protein kinase pim-1
Ligand
BDBM227381
Substrate
Meas. Tech.
PIM Kinase Binding Assay
pH
7.2±n/a
Temperature
298.15±n/a K
Ki
0.003±n/a nM
Comments
extracted
Citation
 Burch, JSun, MWang, XBlackaby, WHodges, AJSharpe, A Cyclic ether pyrazol-4-yl-heterocyclyl-carboxamide compounds and methods of use US Patent  US9328106 Publication Date 5/3/2016 
Target
Name:
Serine/threonine-protein kinase pim-1
Synonyms:
PIM-1 Kinase PIM1_HUMAN Serine/threonine-protein kinase (PIM1) Serine/threonine-protein kinase PIM1 | Serine/threonine-protein kinase pim-1 (PIM1)
Type:
Protein
Mol. Mass.:
35681.82
Organism:
Homo sapiens (Human)
Description:
P11309
Residue:
313
  
Inhibitor
Name:
BDBM227381
Synonyms:
US9328106, 332
Type:
Small organic molecule
Emp. Form.:
C20H20F4N6O2S
Mol. Mass.:
484.47
SMILES:
Cn1ncc(NC(=O)c2nc(sc2N)-c2c(F)ccc(F)c2F)c1[C@@H]1CC[C@@H](N)[C@H](F)CO1
: